{"text_format":"1","workbook":"xlsx","n_sheets":14,"sheets":["Macros","PDF_sheet","Donnees_VRD","Donnees_engin","Donnees_installation","Resultats_simulation","calcul_cable","Etude_CO2","Case_liste","Database_tranchee","Chargement_tourets","lg_database_prysmian","lg_database_GC","diametre_cable"],"not_rendered":{"charts":0,"images":6,"macros":1,"external_links":0,"defined_names":8,"comments":4,"pivot_tables":0},"unopened":[],"bounds":{"document_bytes":16777216,"sheet_cells":100000,"rows_first":2000,"rows_last":500,"rows_between":2000,"halvings":0,"cell_chars":16384,"cell_head_chars":4096},"cells_cut":0,"cells_raw":0,"read":"whole","date_system":"1900"}

{"sheet":"Macros","index":0,"n_rows":7,"n_cols":7,"rows_kept":7,"cut":false,"hidden":false,"merged":[]}
[]
[]
[null,null,null,null,null,null,"Bienvenue dans le logiciel de simulation "]
[null,null,null,null,null,null,"de coût d'installation de câble EDR développé par Prysmian Group"]
[]
[null,null,null,null,null,null,"Afin de faire fonctionner ce logiciel"]
[null,null,null,null,null,null,"Merci d'activer les macros de ce fichier"]

{"sheet":"PDF_sheet","index":1,"n_rows":62,"n_cols":16,"rows_kept":62,"cut":false,"hidden":false,"merged":[[61,7,61,15],[61,0,61,6],[4,7,4,15],[29,4,29,6],[6,8,6,10],[6,12,6,14],[6,0,6,2],[6,4,6,6],[4,0,4,6]]}
[]
[]
[]
[]
[{"$f":"\"Simulation de coûts câble EDR vs standard - Prysmian Group \" & \"- \" & DAY(TODAY()) & \"/\"& TEXT(MONTH(TODAY()),\"00\") & \"/\" & YEAR(TODAY())  & \" - Page 1/2\"","v":"Simulation de coûts câble EDR vs standard - Prysmian Group - 24/01/2019 - Page 1/2"},null,null,null,null,null,null,{"$f":"\"Simulation de coûts câble EDR vs standard - Prysmian Group \" & \"- \" & DAY(TODAY()) & \"/\"& TEXT(MONTH(TODAY()),\"00\") & \"/\" & YEAR(TODAY()) & \" - Page 2/2\"","v":"Simulation de coûts câble EDR vs standard - Prysmian Group - 24/01/2019 - Page 2/2"}]
[]
["Données VRD",null,null,null,"Données engin",null,null,"Résultats simulation","câble standard",null,null,null,"câble EDR"]
["Longueur de liaison",{"$f":"Donnees_VRD!C3","v":0},"mètres",null,"Prix utilisation tractopelle",{"$f":"Donnees_engin!C4","v":0},"€/jour","Longueur de la liaison",{"$f":"Resultats_simulation!C3","v":0},"mètres",null,null,{"$f":"Resultats_simulation!H3","v":0},"mètres"]
["Nombre de câbles",{"$f":"Donnees_VRD!C6","v":0},"câble(s)",null,"Forfait Transport tractopelle",{"$f":"Donnees_engin!C5","v":0},"€","Nombre de câbles",{"$f":"B9","v":0},null,null,null,{"$f":"B9","v":0}]
[null,null,null,null,"Consommation carburant",{"$f":"calcul_cable!C25","v":9},"L/h"]
["Largeur tranchée",{"$f":"Donnees_VRD!C7","v":0},"mètres",null,null,null,null,"Volume de terre excavée",{"$f":"Resultats_simulation!C5","v":{"$error":"#DIV/0!"}},"mètres3",null,null,{"$f":"Resultats_simulation!H5","v":{"$error":"#DIV/0!"}},"mètres3"]
["Profondeur tranchée",{"$f":"Donnees_VRD!C8","v":0},"mètres",null,"Prix utilisation trancheuse",{"$f":"Donnees_engin!C8","v":0},"€/jour","Volume de terre (déblais)",{"$f":"Resultats_simulation!C6","v":{"$error":"#DIV/0!"}},"mètres3",null,null,{"$f":"Resultats_simulation!H6","v":0},"mètres3"]
["Epaisseur du lit de sable",{"$f":"Donnees_VRD!C9","v":0},"mètres",null,"Forfait Transport trancheuse",{"$f":"Donnees_engin!C9","v":0},"€","Poids terre (déblais)",{"$f":"Resultats_simulation!C7","v":{"$error":"#DIV/0!"}},"Tonnes",null,null,{"$f":"Resultats_simulation!H7","v":0},"Tonnes"]
["Largeur tranchée raccordement",{"$f":"Donnees_VRD!C11","v":0},"mètres",null,"Consommation carburant",{"$f":"calcul_cable!C28","v":15},"L/h","Nombre de camions pour évacuation",{"$f":"Resultats_simulation!C8","v":{"$error":"#DIV/0!"}},"camions de",{"$f":"Resultats_simulation!E8","v":0},"tonnes",{"$f":"Resultats_simulation!H8","v":{"$error":"#DIV/0!"}},"camion(s) de",{"$f":"Resultats_simulation!J8","v":0},"tonnes"]
["Longueur tranchée raccordement",{"$f":"Donnees_VRD!C12","v":0},"mètres",null,null,null,null,"Coût traitement des déchets",{"$f":"Resultats_simulation!C9","v":{"$error":"#DIV/0!"}},"€",null,null,{"$f":"Resultats_simulation!H9","v":0},"€"]
{"$rows_left_out":48}
{"sheet":"Donnees_VRD","index":2,"n_rows":37,"n_cols":8,"rows_kept":37,"cut":false,"hidden":true,"merged":[]}
[]
[null,"Saisie des données VRD"]
[null,"Longueur de liaison",null,"mètres"]
[null,null,null,null,19]
[null,"Localisation chantier",null,null,53]
[null,"Nombre de câble dans tranchée",null,"cables"]
[null,"Largeur tranchée",null,"mètres std",50,"EDR",0.4,"mètres"]
[null,"Profondeur tranchée",null,"mètres std",51,"EDR",0.9,"mètres"]
[null,"Epaisseur du lit de sable",null,"mètres",52]
[]
[null,"Largeur tranchée raccordement",null,"mètres",57]
[null,"Longueur tranchée raccordement",null,"mètres",58]
[null,"Profondeur tranchée raccordement",null,"mètres std",56,"EDR",0.9,"mètres"]
[null,"Epaisseur du lit de sable raccordement",null,"mètres",59]
[]
{"$rows_left_out":23}
{"sheet":"Donnees_engin","index":3,"n_rows":22,"n_cols":7,"rows_kept":22,"cut":false,"hidden":true,"merged":[]}
[]
[null,"Saisie des données engin"]
[null,"Tractopelle"]
[null,"Prix utilisation à la journée",null,"€/jour",22,580,"€/jour"]
[null,"Forfait Transport",null,"€",21]
[]
[null,"Trancheuse à roue"]
[null,"Prix utilisation à la journée",null,"€/jour",24]
[null,"Forfait Transport",null,"€",23]
[]
[null,"Trancheuse à chaine"]
[null,"Prix utilisation à la journée",null,"€/jour",26]
[null,"Forfait Transport",null,"€",25]
[]
[]
{"$rows_left_out":8}
{"sheet":"Donnees_installation","index":4,"n_rows":28,"n_cols":8,"rows_kept":28,"cut":false,"hidden":true,"merged":[]}
[]
[null,"Saisie des données installation cable"]
[null,"Type de cables","3 x 1 x 300 ALU"]
[null,"Coût horaire d'un operateur",null,"€/heure",35]
[null,"Fournisseur","GC",null,null,null,null,"GC"]
[null,"Prix du cable standard",null,"€",33]
[null,"Prix du cable EDR",null,"€",null,"EDR"]
[null,"Type de voltage","12/20 kV"]
[null,"Temps de pose standard",null,"m/jour"]
[null,"Nombre d'opérateurs",null,"personnes",null,3,"personnes"]
[null,"Temps de pose EDR",1000,"m/heure",null,null,null,"3 x 1 x 50 ALU"]
[null,"Type de tourets souhaités","J",null,null,null,null,"3 x 1 x 95 ALU"]
[null,"Longueur cable standard",{"$f":"E13","v":800},"mètres",{"$f":"IF(C8=\"12/20 kV\",(IF(C5=\"Prysmian\",(VLOOKUP(C12,lg_database_prysmian!A32:I34,IF(C3=H11,3,(IF(C3=H12,4,(IF(C3=H13,5,(IF(C3=H14,6,(IF(C3=H15,7,(IF(C3=H16,8,(IF(C3=H17,9,))))))))))))),FALSE)),(VLOOKUP(C12,lg_database_GC!A19:I21,IF(C3=H11,3,(IF(C3=H12,4,(IF(C3=H13,5,(IF(C3=H14,6,(IF(C3=H15,7,(IF(C3=H16,8,(IF(C3=H17,9,))))))))))))),FALSE)))),(IF(C5=\"Prysmian\",(VLOOKUP(C12,lg_database_prysmian!A93:I95,IF(C3=H11,3,(IF(C3=H12,4,(IF(C3=H13,5,(IF(C3=H14,6,(IF(C3=H15,7,(IF(C3=H16,8,(IF(C3=H17,9,))))))))))))),FALSE)),(VLOOKUP(C12,lg_database_GC!A54:I56,IF(C3=H11,3,(IF(C3=H12,4,(IF(C3=H13,5,(IF(C3=H14,6,(IF(C3=H15,7,(IF(C3=H16,8,(IF(C3=H17,9,))))))))))))),FALSE)))))","v":800},null,null,"3 x 1 x 150 ALU"]
[null,"Longueur cable EDR",{"$f":"E14","v":600},"mètres",{"$f":"IF(C8=\"12/20 kV\",(IF(C5=\"Prysmian\",(VLOOKUP(C12,lg_database_prysmian!A7:I9,IF(C3=H11,3,(IF(C3=H12,4,(IF(C3=H13,5,(IF(C3=H14,6,(IF(C3=H15,7,(IF(C3=H16,8,(IF(C3=H17,9,))))))))))))),FALSE)),(VLOOKUP(C12,lg_database_GC!A7:I9,IF(C3=H11,3,(IF(C3=H12,4,(IF(C3=H13,5,(IF(C3=H14,6,(IF(C3=H15,7,(IF(C3=H16,8,(IF(C3=H17,9,))))))))))))),FALSE)))),(IF(C5=\"Prysmian\",(VLOOKUP(C12,lg_database_prysmian!A81:I83,IF(C3=H11,3,(IF(C3=H12,4,(IF(C3=H13,5,(IF(C3=H14,6,(IF(C3=H15,7,(IF(C3=H16,8,(IF(C3=H17,9,))))))))))))),FALSE)),(VLOOKUP(C12,lg_database_GC!A42:I44,IF(C3=H11,3,(IF(C3=H12,4,(IF(C3=H13,5,(IF(C3=H14,6,(IF(C3=H15,7,(IF(C3=H16,8,(IF(C3=H17,9,))))))))))))),FALSE)))))","v":600},null,null,"3 x 1 x 240 ALU"]
[null,"Charge utile ",6000,"Kg",{"$f":"IF(C8=\"12/20 kV\",(IF(C5=\"Prysmian\",(VLOOKUP(C12,lg_database_prysmian!A56:J58,9,FALSE)),(VLOOKUP(C12,lg_database_GC!A30:J32,9,FALSE)))),(IF(C5=\"Prysmian\",(VLOOKUP(C12,lg_database_prysmian!A103:J105,9,FALSE)),(VLOOKUP(C12,lg_database_GC!A30:J32,9,FALSE)))))","v":6000},null,null,"3 x 1 x 300 ALU"]
{"$rows_left_out":14}
{"sheet":"Resultats_simulation","index":5,"n_rows":82,"n_cols":15,"rows_kept":82,"cut":false,"hidden":true,"merged":[]}
[]
[null,"Saisie des données installation cable","Cable standard",null,null,null,null,"Cable EDR"]
[null,"Longueur de la tranchée",{"$f":"Donnees_VRD!C3","v":0},"mètres",null,null,null,{"$f":"Donnees_VRD!C3","v":0},"mètres"]
[]
[null,"Volume de terre excavée",{"$f":"Donnees_VRD!C8*Donnees_VRD!C7*Donnees_VRD!C3+C19*((Donnees_VRD!C11-Donnees_VRD!C7)*Donnees_VRD!C8*Donnees_VRD!C12)","v":{"$error":"#DIV/0!"}},"mètres3",null,null,null,{"$f":"C5","v":{"$error":"#DIV/0!"}},"mètres3"]
[null,"Volume de terre (déblais)",{"$f":"(Donnees_VRD!C11*Donnees_VRD!C12*Donnees_VRD!C14*Resultats_simulation!C19)+(Donnees_VRD!C3*Donnees_VRD!C7*Donnees_VRD!C9)-(C19*Donnees_VRD!C12*Donnees_VRD!C9*Donnees_VRD!C7)","v":{"$error":"#DIV/0!"}},"mètres3",null,null,null,0,"mètres3"]
[null,"Poids terre (déblais)",{"$f":"C6*Donnees_VRD!$C$16","v":{"$error":"#DIV/0!"}},"Tonnes",null,null,null,{"$f":"H6*Donnees_VRD!$C$16","v":0},"Tonnes"]
[null,"Nombre de camions pour évacuation",{"$f":"ROUNDUP(C7/(E8),0)","v":{"$error":"#DIV/0!"}},"camions de",{"$f":"Donnees_VRD!C29","v":0},"tonnes",null,{"$f":"H7/J8","v":{"$error":"#DIV/0!"}},"camions de",{"$f":"Donnees_VRD!C29","v":0},"tonnes"]
[null,"Coût traitement des déchets",{"$f":"Donnees_VRD!C34*Resultats_simulation!C6-Donnees_VRD!C35*Resultats_simulation!C6","v":{"$error":"#DIV/0!"}},"€",null,null,null,{"$f":"Donnees_VRD!C34*Resultats_simulation!H6-Donnees_VRD!C35*Resultats_simulation!H6","v":0},"€"]
[null,"Coût évacuation déblais",{"$f":"((((Donnees_VRD!$C$31/60)+(Donnees_VRD!$C$26/(Donnees_VRD!$C$30)))*2*Donnees_VRD!$C$33)+(Donnees_VRD!$C$26*2*Donnees_VRD!$C$32*calcul_cable!$C$14))*Resultats_simulation!C8","v":{"$error":"#DIV/0!"}},"€",null,null,null,{"$f":"((((Donnees_VRD!$C$31/60)+(Donnees_VRD!$C$26*(Donnees_VRD!$C$30/60)))*2*Donnees_VRD!$C$33)+(Donnees_VRD!$C$26*2*Donnees_VRD!$C$32*calcul_cable!$C$14))*Resultats_simulation!H8","v":{"$error":"#DIV/0!"}},"€"]
[null,"Coût traitement de la terre",{"$f":"C9+C10+C31","v":{"$error":"#DIV/0!"}},"€",null,null,null,{"$f":"H9+H10+H31","v":{"$error":"#DIV/0!"}},"€"]
[]
[null,"Volume de sable nécessaire pour pose cable",{"$f":"(Donnees_VRD!C3*Donnees_VRD!C7*Donnees_VRD!C9)-((PI()*((calcul_cable!C6)/2)^2*Donnees_VRD!C3)*0.64*Donnees_VRD!C6)-(C19*Donnees_VRD!C12*Donnees_VRD!C9*Donnees_VRD!C7)","v":{"$error":"#DIV/0!"}},"mètres3",null,null,null,0,"mètres3"]
[null,"Poids du sable nécessaire pour pose cable",{"$f":"C13*Donnees_VRD!$C$17","v":{"$error":"#DIV/0!"}},"Tonnes",null,null,null,{"$f":"H13*Donnees_VRD!$C$17","v":0},"Tonnes"]
[null,"Nombre de camions de sable pour pose cable",{"$f":"ROUNDUP(C14/(E15),0)","v":{"$error":"#DIV/0!"}},"camions de",{"$f":"Donnees_VRD!C29","v":0},"tonnes",null,{"$f":"ROUNDUP(H14/J15,1)","v":{"$error":"#DIV/0!"}},"camions de",{"$f":"Donnees_VRD!C29","v":0},"tonnes"]
{"$rows_left_out":68}
{"sheet":"calcul_cable","index":6,"n_rows":33,"n_cols":10,"rows_kept":33,"cut":false,"hidden":true,"merged":[]}
[]
[null,"Calcul cable","Cable standard",null,null,"Cable EDR"]
[null,"Voltage",{"$f":"Donnees_installation!C8","v":"12/20 kV"},null,null,{"$f":"C3","v":"12/20 kV"}]
[null,"Type de cables",{"$f":"Donnees_installation!C3","v":"3 x 1 x 300 ALU"},null,null,{"$f":"Donnees_installation!C3","v":"3 x 1 x 300 ALU"}]
[null,"Fournisseur",{"$f":"Donnees_installation!C5","v":"GC"},null,null,{"$f":"C5","v":"GC"}]
[null,"Diamètre torsade",{"$f":"IF(C3=\"12/20 kV\",(IF(C5=\"Prysmian\",(VLOOKUP(C4,diametre_cable!H3:J9,3,FALSE)),(VLOOKUP(C4,diametre_cable!H25:J31,3,FALSE)))),(IF(C5=\"Prysmian\",(VLOOKUP(C4,diametre_cable!H14:J20,3,FALSE)),(VLOOKUP(C4,diametre_cable!H36:J42,3,FALSE)))))","v":0.09},"mètres",null,{"$f":"IF(F3=\"12/20 kV\",(IF(F5=\"Prysmian\",(VLOOKUP(F4,diametre_cable!B3:D9,3,FALSE)),(VLOOKUP(F4,diametre_cable!B25:D31,3,FALSE)))),(IF(F5=\"Prysmian\",(VLOOKUP(F4,diametre_cable!B14:D20,3,FALSE)),(VLOOKUP(F4,diametre_cable!B36:D42,3,FALSE)))))","v":0.10100000000000001},"mètres"]
[null,"Type de touret souhaité",{"$f":"Donnees_installation!C12","v":"J"},null,null,{"$f":"Donnees_installation!C12","v":"J"}]
[null,"Longueur par touret",{"$f":"Donnees_installation!C13","v":800},null,null,{"$f":"Donnees_installation!C14","v":600}]
[]
[null,"Prix accessoire pièce",{"$f":"Donnees_installation!C22","v":0},"€",null,{"$f":"Donnees_installation!C22","v":0},"€"]
[null,"Nombre accesoires",{"$f":"ROUNDUP(((Donnees_VRD!$C$3/calcul_cable!C8)-1),0)","v":-1},null,null,{"$f":"ROUNDUP(((Donnees_VRD!$C$3/calcul_cable!F8)-1),0)","v":-1}]
[]
[null,"Consommation camion 20T",35,"L/100km"]
[null,"Consommation camion 20T",{"$f":"C13/100","v":0.35},"L/km"]
[]
{"$rows_left_out":19}
{"sheet":"Etude_CO2","index":7,"n_rows":45,"n_cols":12,"rows_kept":45,"cut":false,"hidden":true,"merged":[]}
[null,null,null,null,null,null,null,null,null,"Facteurs d’émission des sources d’énergie de l’arrêté du 10 avril 2012"]
[null,"GES = Quantité de gaz émis´ PRG",null,null,null,null,null,null,null,"Nature de la source d'énergie","Type détaillé de la source d'énergie","Facteur émission (kg CO2 par litre)"]
[null,"Résultat des mesures des effluents gazeux (débit,concentrations)",null,null,null,null,null,null,null,"Essence automobile","SP95 - SP98",2.71]
[null,"Pouvoir de Réchauffement Global des gaz (PRG)",null,null,null,null,null,null,null,"Gazole","Gazole routier à la pompe ",3.07]
[null,null,null,null,null,null,null,null,null,null,null,{"$f":"L4","v":3.07}]
[]
[null,"GES = Donnée d 'activité ´ FE ´ PRG"]
[null,"Donnée d’activité"]
[null,"Facteur d’émission (FE)"]
[null,"PRG"]
[]
[]
[null,"Base consommation véhicule"]
[null,"Type (T)","Conso L/100km","Conso L/km",null,"Type (T)","Conso L/100km"]
[null,"0 a 3",43.2,{"$f":"C15/100","v":0.43200000000000005},null,0,43.2]
{"$rows_left_out":31}
{"sheet":"Case_liste","index":8,"n_rows":303,"n_cols":29,"rows_kept":303,"cut":false,"hidden":true,"merged":[]}
[1]
[2]
[3]
[4,"cable",null,"monteurs"]
[5]
[6,1,null,1,null,null,null,null,null,null,null,null,null,null,null,null,null,null,null,null,null,null,null,null,"EDR - PR - 18/30kV",null,"EDR 18/30 kV",null,"EDR 12/20 kV"]
[7,2,null,2,"GC",null,null,null,null,"GBM",null,null,null,null,"EDR prysmian",null,null,null,null,null,null,"EDR - PR - 12/20kV",null,null,"95 &150",null,240,null,240]
[8,3,null,3,"Prysmian",null,null,null,null,"GBL"]
[9,4,null,null,null,null,null,null,null,"HBM",null,null,"EDR prysmian",null,"3 x 1 x 50 ALU","3 x 1 x 95 ALU","3 x 1 x 150 ALU","3 x 1 x 240 ALU","3 x 1 x 240 CU",null,null,null,null,null,"H",null,"J",null,"I"]
[10,null,null,null,null,null,null,null,null,"HBL",null,null,null,null,"GBM","GBM","GBM","HBM","HBM",null,null,"3 x 1 x 50 ALU",null,null,"I",null,null,null,"J"]
[11,null,null,null,null,null,null,null,null,"IBM",null,null,"H",null,"HBM","HBM","HBM","IBM","IBM",null,null,"3 x 1 x 95 ALU",null,null,"J"]
[12,null,null,null,null,null,null,null,null,"GBE",null,null,"I",null,"IBM","IBM","IBM","HBE","HBE",null,null,"3 x 1 x 150 ALU"]
[13,null,null,null,null,null,null,null,null,"HBE",null,null,"J",null,"GBE","HBE","HBE","IBE","IBE",null,null,"3 x 1 x 240 ALU",null,null,"3 x 1 x 95 ALU"]
[14,null,null,null,null,null,null,null,null,"HBW34",null,null,null,null,"HBE","IBE","IBE","BOXY","BOXY",null,null,"3 x 1 x 300 ALU",null,null,"3 x 1 x 150 ALU"]
[15,null,null,null,null,null,"Cable disponible",null,null,"IBE",null,null,null,null,"HBW34","BOXY","BOXY","JFM1","JFM1",null,null,"3 x 1 x 400 ALU",null,null,"3 x 1 x 240 ALU"]
{"$rows_left_out":289}
{"sheet":"Database_tranchee","index":9,"n_rows":18,"n_cols":12,"rows_kept":18,"cut":false,"hidden":true,"merged":[]}
[null,1,2,3,4,5,6,7,8,9,10,11]
[]
[null,"Nombre de câble","Largeur std","Largeur EDR","Profondeur std","Profondeur EDR","Epaisseur lit de sable","Largueur racc","Longueur racc","Profondeur racc std","Profondeur racc EDR","Epaisseur sable racc"]
[null,1,0.3,0.2,0.8,0.7,0.3,1,1.1000000000000001,0.8,0.7,{"$f":"G4","v":0.3}]
[null,2,0.5,{"$f":"C5-0.1","v":0.4},0.8,0.7,0.3,{"$f":"E5+0.2","v":1},1.1000000000000001,0.8,{"$f":"F5","v":0.7},{"$f":"G5","v":0.3}]
[null,3,0.7,{"$f":"C6-0.1","v":0.6},0.8,0.7,0.3,{"$f":"E6+0.2","v":1},1.1000000000000001,0.8,{"$f":"F6","v":0.7},{"$f":"G6","v":0.3}]
[null,4,0.5,{"$f":"C7-0.1","v":0.4},1,0.9,0.5,{"$f":"E7+0.2","v":1.2},1.1000000000000001,{"$f":"E7","v":1},{"$f":"F7","v":0.9},{"$f":"G7","v":0.5}]
[]
[null,"Nombre de câble dans tranchée",{"$f":"Donnees_VRD!C6","v":0},"cables"]
[]
[null,"Largeur tranchée",{"$f":"VLOOKUP($C$9,Database_tranchee!B4:L7,2,FALSE)","v":{"$error":"#N/A"}},"mètres std",50,"EDR",{"$f":"VLOOKUP($C$9,Database_tranchee!B4:L7,3,FALSE)","v":{"$error":"#N/A"}},"mètres"]
[null,"Profondeur tranchée",{"$f":"VLOOKUP($C$9,Database_tranchee!B4:L7,4,FALSE)","v":{"$error":"#N/A"}},"mètres std",51,"EDR",{"$f":"VLOOKUP($C$9,Database_tranchee!B4:L7,5,FALSE)","v":{"$error":"#N/A"}},"mètres"]
[null,"Epaisseur du lit de sable",{"$f":"VLOOKUP($C$9,Database_tranchee!B4:L7,6,FALSE)","v":{"$error":"#N/A"}},"mètres",52]
[]
[null,"Largeur tranchée raccordement",{"$f":"VLOOKUP($C$9,Database_tranchee!B4:L7,7,FALSE)","v":{"$error":"#N/A"}},"mètres",57]
{"$rows_left_out":4}
{"sheet":"Chargement_tourets","index":10,"n_rows":33,"n_cols":5,"rows_kept":33,"cut":false,"hidden":true,"merged":[]}
["Infos transmis par Chanoine Corinne le 30 octobre 2018"]
[null,null,null,"Capacité de chargement d'un camion "]
[null,null,null,"Encombrement / surface du plancher de 2.6 x 13.2m"]
[]
[null,"Diamètre ","Nombre de tourets vides","Nombre de tourets pleins - chargement < ou = à 24T","Remarque"]
[null,"A",480,85,"68 si ABP largeur 0.58 m"]
[null,"B",220,56]
[null,"C",120,48]
[null,"D ",81,30]
[null,"E",69,27]
[null,"F",48,21]
[null,"G",18,12,"ou 13 selon le poids (1 en canon à l'arrière)"]
[null,"H",16,10,"ou 11 selon le poids (1 en canon à l'arrière)"]
[null,"I",12,8,"ou 10 si longueur >13 m"]
[null,"J",8,8,"ou 4 si surbaissée si >3.5 / touret"]
{"$rows_left_out":19}
{"sheet":"lg_database_prysmian","index":11,"n_rows":105,"n_cols":11,"rows_kept":105,"cut":false,"hidden":true,"merged":[[74,2,74,9],[75,2,75,9],[86,2,86,9],[87,2,87,9],[25,2,25,9],[26,2,26,9],[51,2,51,9],[0,2,0,9],[1,2,1,9],[52,8,53,8],[52,9,54,9],[52,10,53,10],[52,2,53,2],[52,3,53,3],[52,4,53,4],[52,5,53,5],[52,6,54,6],[52,7,53,7],[99,10,100,10],[98,2,98,9],[99,2,100,2],[99,3,100,3],[99,4,100,4],[99,5,100,5],[99,6,101,6],[99,7,100,7],[99,8,100,8],[99,9,101,9]]}
[null,null,"CABLES EDR"]
[null,null,"12/20kV"]
["Touret",null,"3 x 1 x 50 ALU","3 x 1 x 95 ALU","3 x 1 x 150 ALU","3 x 1 x 240 ALU","3 x 1 x 300 ALU","3 x 1 x 400 ALU","3 x 1 x 240 CU"]
[null,"Code  CA","P26EDR-163","P26EDR-165","P26EDR-167","P26EDR-169","P26EDR-170","P26EDR-171","P26EDR-885"]
[null,"Code SAP",20234567,20171640,20171641,20171642,20171645,"NC",20171646]
[null,"Touret"]
["H","HBM",330,240,230,215,0,0,215]
["I","IBM",590,475,455,355,0,0,355]
["J","JFM2",760,650,615,490,440,0,480]
["GBM","DOF190M",170,160,155,0,0,0,0]
["GBL","DOF188M",0,0,0,0,0,0,0]
["HBL","DOF220F",0,0,0,0,0,0,0]
["GBE","DWF1900",280,0,0,0,0,0,0]
["HBE","DWF2200",330,240,230,215,0,0,215]
["HBW34","DWF2240",470,0,0,0,0,0,0]
{"$rows_left_out":91}
{"sheet":"lg_database_GC","index":12,"n_rows":56,"n_cols":15,"rows_kept":56,"cut":false,"hidden":true,"merged":[[35,2,35,9],[36,2,36,9],[47,2,47,9],[48,2,48,9],[26,7,27,7],[26,8,27,8],[26,9,28,9],[26,10,27,10],[0,2,0,9],[1,2,1,9],[12,2,12,9],[13,2,13,9],[25,2,25,9],[26,2,27,2],[26,3,27,3],[26,4,27,4],[26,5,27,5],[26,6,28,6]]}
[null,null,"CABLES EDR"]
[null,null,"12/20kV"]
["Touret",null,"3 x 1 x 50 ALU","3 x 1 x 95 ALU","3 x 1 x 150 ALU","3 x 1 x 240 ALU","3 x 1 x 300 ALU","3 x 1 x 400 ALU","3 x 1 x 240 CU"]
[]
[]
[null,"Touret"]
["I",null,750,600,600,500,400,300,400]
["H",null,400,300,300,275,200,150,250]
["J",null,1000,875,875,650,600,425,600]
[]
[]
[]
[null,null,"CABLES STANDARDS - TORSADE"]
[null,null,"12/20kV"]
["Touret",null,"3 x 1 x 50 ALU","3 x 1 x 95 ALU","3 x 1 x 150 ALU","3 x 1 x 240 ALU","3 x 1 x 300 ALU","3 x 1 x 400 ALU","3 x 1 x 240 CU"]
{"$rows_left_out":42}
{"sheet":"diametre_cable","index":13,"n_rows":42,"n_cols":10,"rows_kept":42,"cut":false,"hidden":true,"merged":[[11,0,11,9],[0,0,0,9],[22,0,22,9],[33,0,33,9]]}
["Cable disponible PRYSMIAN 12/20 kV"]
["Type","Nature","Nombre de cable","Diamètre total torsade (m)",null,null,"Type","Nature","Nombre de cable","Diamètre total torsade (m)"]
["EDR","3 x 1 x 50 ALU",3,7.2499999999999995E-2,null,null,"Standard","3 x 1 x 50 ALU",3,5.9700000000000003E-2]
["EDR","3 x 1 x 95 ALU",3,7.9500000000000001E-2,null,null,"Standard","3 x 1 x 95 ALU",3,6.6200000000000009E-2]
["EDR","3 x 1 x 150 ALU",3,8.1099999999999992E-2,null,null,"Standard","3 x 1 x 150 ALU",3,6.83E-2]
["EDR","3 x 1 x 240 ALU",3,9.11E-2,null,null,"Standard","3 x 1 x 240 ALU",3,7.8700000000000006E-2]
["EDR","3 x 1 x 240 CU",3,9.1200000000000003E-2,null,null,"Standard","3 x 1 x 240 CU",3,7.8700000000000006E-2]
["EDR","3 x 1 x 300 ALU",3,9.6849999999999992E-2,null,null,"Standard","3 x 1 x 300 ALU",3,8.3629999999999996E-2]
["EDR","3 x 1 x 400 ALU",3,0.10970000000000001,null,null,"Standard","3 x 1 x 400 ALU",3,9.4629999999999992E-2]
[]
[]
["Cable disponible PRYSMIAN 18/30 kV"]
["Type","Nature","Nombre de cable","Diamètre total torsade (m)",null,null,"Type","Nature","Nombre de cable","Diamètre total torsade (m)"]
["EDR","3 x 1 x 50 ALU",3,8.4699999999999998E-2,null,null,"Standard","3 x 1 x 50 ALU",3,7.1379999999999999E-2]
["EDR","3 x 1 x 95 ALU",3,8.7999999999999995E-2,null,null,"Standard","3 x 1 x 95 ALU",3,7.3900000000000007E-2]
{"$rows_left_out":27}